← back to Terminal Status
verification/TK-11317-integration/negative-control.txt
338 lines
test_backfill_carries_purple_through_owner_changed (test_owner_change_carry.OwnerChangeCarryTests.test_backfill_carries_purple_through_owner_changed) ... FAIL
test_backfill_never_flattens_carried_attention_to_green (test_owner_change_carry.OwnerChangeCarryTests.test_backfill_never_flattens_carried_attention_to_green) ... FAIL
test_carried_from_records_prior_owner_identity (test_owner_change_carry.OwnerChangeCarryTests.test_carried_from_records_prior_owner_identity) ... ERROR
test_deferential_green_keeps_carried_attention (test_owner_change_carry.OwnerChangeCarryTests.test_deferential_green_keeps_carried_attention) ... ERROR
test_deferential_green_keeps_owner_status_unverified (test_owner_change_carry.OwnerChangeCarryTests.test_deferential_green_keeps_owner_status_unverified) ... ERROR
test_explicit_set_green_clears_carried_from (test_owner_change_carry.OwnerChangeCarryTests.test_explicit_set_green_clears_carried_from) ... ERROR
test_explicit_set_green_clears_owner_status_unverified (test_owner_change_carry.OwnerChangeCarryTests.test_explicit_set_green_clears_owner_status_unverified) ... ERROR
test_legacy_dot_only_attention_carried_when_json_prior_is_green (test_owner_change_carry.OwnerChangeCarryTests.test_legacy_dot_only_attention_carried_when_json_prior_is_green) ... ERROR
test_legacy_dot_only_attention_carried_when_no_json_record_at_all (test_owner_change_carry.OwnerChangeCarryTests.test_legacy_dot_only_attention_carried_when_no_json_record_at_all) ... ERROR
test_load_accepts_records_with_and_without_carried_from (test_owner_change_carry.OwnerChangeCarryTests.test_load_accepts_records_with_and_without_carried_from) ... ERROR
test_missing_reason_still_green_floors_via_backfill (test_owner_change_carry.OwnerChangeCarryTests.test_missing_reason_still_green_floors_via_backfill) ... ok
test_no_prior_record_at_all_settles_to_yellow_status_needed (test_owner_change_carry.OwnerChangeCarryTests.test_no_prior_record_at_all_settles_to_yellow_status_needed) ... ERROR
test_old_owner_cannot_write_after_tty_reuse (test_owner_change_carry.OwnerChangeCarryTests.test_old_owner_cannot_write_after_tty_reuse) ... ok
test_prior_green_yields_none_and_settles_to_yellow_status_needed (test_owner_change_carry.OwnerChangeCarryTests.test_prior_green_yields_none_and_settles_to_yellow_status_needed) ... ERROR
test_prior_lightblue_record_carried (test_owner_change_carry.OwnerChangeCarryTests.test_prior_lightblue_record_carried) ... ERROR
test_prior_orange_record_carried (test_owner_change_carry.OwnerChangeCarryTests.test_prior_orange_record_carried) ... ERROR
test_prior_pink_yields_none_and_settles_to_yellow_status_needed (test_owner_change_carry.OwnerChangeCarryTests.test_prior_pink_yields_none_and_settles_to_yellow_status_needed) ... ERROR
test_prior_purple_record_carried (test_owner_change_carry.OwnerChangeCarryTests.test_prior_purple_record_carried) ... ERROR
test_prior_record_ticket_is_carried_from_json_source (test_owner_change_carry.OwnerChangeCarryTests.test_prior_record_ticket_is_carried_from_json_source) ... ERROR
test_prior_yellow_record_carried (test_owner_change_carry.OwnerChangeCarryTests.test_prior_yellow_record_carried) ... ERROR
test_priority_choice_lightblue_outranks_everything (test_owner_change_carry.OwnerChangeCarryTests.test_priority_choice_lightblue_outranks_everything) ... ERROR
test_priority_choice_when_json_and_legacy_disagree (test_owner_change_carry.OwnerChangeCarryTests.test_priority_choice_when_json_and_legacy_disagree) ... ERROR
test_row_for_canonical_owner_status_unverified_record_carries_warning (test_owner_change_carry.OwnerChangeCarryTests.test_row_for_canonical_owner_status_unverified_record_carries_warning) ... ERROR
test_row_for_owner_changed_shows_carried_colour_not_none (test_owner_change_carry.OwnerChangeCarryTests.test_row_for_owner_changed_shows_carried_colour_not_none) ... FAIL
test_row_for_owner_changed_with_no_prior_attention_shows_yellow (test_owner_change_carry.OwnerChangeCarryTests.test_row_for_owner_changed_with_no_prior_attention_shows_yellow) ... FAIL
test_row_never_renders_none_for_owner_changed (test_owner_change_carry.OwnerChangeCarryTests.test_row_never_renders_none_for_owner_changed) ...
test_row_never_renders_none_for_owner_changed (test_owner_change_carry.OwnerChangeCarryTests.test_row_never_renders_none_for_owner_changed) (color='purple') ... FAIL
test_row_never_renders_none_for_owner_changed (test_owner_change_carry.OwnerChangeCarryTests.test_row_never_renders_none_for_owner_changed) (color='orange') ... FAIL
test_row_never_renders_none_for_owner_changed (test_owner_change_carry.OwnerChangeCarryTests.test_row_never_renders_none_for_owner_changed) (color='yellow') ... FAIL
test_row_never_renders_none_for_owner_changed (test_owner_change_carry.OwnerChangeCarryTests.test_row_never_renders_none_for_owner_changed) (color='lightblue') ... FAIL
test_row_never_renders_none_for_owner_changed (test_owner_change_carry.OwnerChangeCarryTests.test_row_never_renders_none_for_owner_changed) (color='green') ... FAIL
test_row_never_renders_none_for_owner_changed (test_owner_change_carry.OwnerChangeCarryTests.test_row_never_renders_none_for_owner_changed) (color='pink') ... FAIL
test_start_command_settles_owner_changed_via_carry (test_owner_change_carry.OwnerChangeCarryTests.test_start_command_settles_owner_changed_via_carry) ... ERROR
test_ticket_binding_preserves_carried_attention_and_flag (test_owner_change_carry.OwnerChangeCarryTests.test_ticket_binding_preserves_carried_attention_and_flag) ... ERROR
test_ticket_binding_preserves_owner_status_unverified (test_owner_change_carry.OwnerChangeCarryTests.test_ticket_binding_preserves_owner_status_unverified) ... ERROR
======================================================================
ERROR: test_carried_from_records_prior_owner_identity (test_owner_change_carry.OwnerChangeCarryTests.test_carried_from_records_prior_owner_identity)
----------------------------------------------------------------------
Traceback (most recent call last):
File "/private/tmp/claude-501/-Users-macstudio3/81614591-265b-48ed-97b7-6518070fa586/scratchpad/preimage-check/test_owner_change_carry.py", line 166, in test_carried_from_records_prior_owner_identity
record = self.store.settle_owner_change(self.new_owner, rows=self.rows)
^^^^^^^^^^^^^^^^^^^^^^^^^^^^^^
AttributeError: 'Store' object has no attribute 'settle_owner_change'
======================================================================
ERROR: test_deferential_green_keeps_carried_attention (test_owner_change_carry.OwnerChangeCarryTests.test_deferential_green_keeps_carried_attention)
----------------------------------------------------------------------
Traceback (most recent call last):
File "/private/tmp/claude-501/-Users-macstudio3/81614591-265b-48ed-97b7-6518070fa586/scratchpad/preimage-check/test_owner_change_carry.py", line 254, in test_deferential_green_keeps_carried_attention
settled = self.store.settle_owner_change(self.new_owner, rows=self.rows)
^^^^^^^^^^^^^^^^^^^^^^^^^^^^^^
AttributeError: 'Store' object has no attribute 'settle_owner_change'
======================================================================
ERROR: test_deferential_green_keeps_owner_status_unverified (test_owner_change_carry.OwnerChangeCarryTests.test_deferential_green_keeps_owner_status_unverified)
----------------------------------------------------------------------
Traceback (most recent call last):
File "/private/tmp/claude-501/-Users-macstudio3/81614591-265b-48ed-97b7-6518070fa586/scratchpad/preimage-check/test_owner_change_carry.py", line 263, in test_deferential_green_keeps_owner_status_unverified
settled = self.store.settle_owner_change(self.new_owner, rows=self.rows)
^^^^^^^^^^^^^^^^^^^^^^^^^^^^^^
AttributeError: 'Store' object has no attribute 'settle_owner_change'
======================================================================
ERROR: test_explicit_set_green_clears_carried_from (test_owner_change_carry.OwnerChangeCarryTests.test_explicit_set_green_clears_carried_from)
----------------------------------------------------------------------
Traceback (most recent call last):
File "/private/tmp/claude-501/-Users-macstudio3/81614591-265b-48ed-97b7-6518070fa586/scratchpad/preimage-check/test_owner_change_carry.py", line 317, in test_explicit_set_green_clears_carried_from
settled = self.store.settle_owner_change(self.new_owner, rows=self.rows)
^^^^^^^^^^^^^^^^^^^^^^^^^^^^^^
AttributeError: 'Store' object has no attribute 'settle_owner_change'
======================================================================
ERROR: test_explicit_set_green_clears_owner_status_unverified (test_owner_change_carry.OwnerChangeCarryTests.test_explicit_set_green_clears_owner_status_unverified)
----------------------------------------------------------------------
Traceback (most recent call last):
File "/private/tmp/claude-501/-Users-macstudio3/81614591-265b-48ed-97b7-6518070fa586/scratchpad/preimage-check/test_owner_change_carry.py", line 310, in test_explicit_set_green_clears_owner_status_unverified
settled = self.store.settle_owner_change(self.new_owner, rows=self.rows)
^^^^^^^^^^^^^^^^^^^^^^^^^^^^^^
AttributeError: 'Store' object has no attribute 'settle_owner_change'
======================================================================
ERROR: test_legacy_dot_only_attention_carried_when_json_prior_is_green (test_owner_change_carry.OwnerChangeCarryTests.test_legacy_dot_only_attention_carried_when_json_prior_is_green)
----------------------------------------------------------------------
Traceback (most recent call last):
File "/private/tmp/claude-501/-Users-macstudio3/81614591-265b-48ed-97b7-6518070fa586/scratchpad/preimage-check/test_owner_change_carry.py", line 86, in test_legacy_dot_only_attention_carried_when_json_prior_is_green
prior = self.store.prior_attention(self.new_owner)
^^^^^^^^^^^^^^^^^^^^^^^^^^
AttributeError: 'Store' object has no attribute 'prior_attention'
======================================================================
ERROR: test_legacy_dot_only_attention_carried_when_no_json_record_at_all (test_owner_change_carry.OwnerChangeCarryTests.test_legacy_dot_only_attention_carried_when_no_json_record_at_all)
----------------------------------------------------------------------
Traceback (most recent call last):
File "/private/tmp/claude-501/-Users-macstudio3/81614591-265b-48ed-97b7-6518070fa586/scratchpad/preimage-check/test_owner_change_carry.py", line 98, in test_legacy_dot_only_attention_carried_when_no_json_record_at_all
prior = self.store.prior_attention(self.new_owner)
^^^^^^^^^^^^^^^^^^^^^^^^^^
AttributeError: 'Store' object has no attribute 'prior_attention'
======================================================================
ERROR: test_load_accepts_records_with_and_without_carried_from (test_owner_change_carry.OwnerChangeCarryTests.test_load_accepts_records_with_and_without_carried_from)
----------------------------------------------------------------------
Traceback (most recent call last):
File "/private/tmp/claude-501/-Users-macstudio3/81614591-265b-48ed-97b7-6518070fa586/scratchpad/preimage-check/test_owner_change_carry.py", line 178, in test_load_accepts_records_with_and_without_carried_from
settled = self.store.settle_owner_change(self.new_owner, rows=self.rows)
^^^^^^^^^^^^^^^^^^^^^^^^^^^^^^
AttributeError: 'Store' object has no attribute 'settle_owner_change'
======================================================================
ERROR: test_no_prior_record_at_all_settles_to_yellow_status_needed (test_owner_change_carry.OwnerChangeCarryTests.test_no_prior_record_at_all_settles_to_yellow_status_needed)
----------------------------------------------------------------------
Traceback (most recent call last):
File "/private/tmp/claude-501/-Users-macstudio3/81614591-265b-48ed-97b7-6518070fa586/scratchpad/preimage-check/test_owner_change_carry.py", line 144, in test_no_prior_record_at_all_settles_to_yellow_status_needed
self.assertIsNone(self.store.prior_attention(self.new_owner))
^^^^^^^^^^^^^^^^^^^^^^^^^^
AttributeError: 'Store' object has no attribute 'prior_attention'
======================================================================
ERROR: test_prior_green_yields_none_and_settles_to_yellow_status_needed (test_owner_change_carry.OwnerChangeCarryTests.test_prior_green_yields_none_and_settles_to_yellow_status_needed)
----------------------------------------------------------------------
Traceback (most recent call last):
File "/private/tmp/claude-501/-Users-macstudio3/81614591-265b-48ed-97b7-6518070fa586/scratchpad/preimage-check/test_owner_change_carry.py", line 125, in test_prior_green_yields_none_and_settles_to_yellow_status_needed
self.assertIsNone(self.store.prior_attention(self.new_owner))
^^^^^^^^^^^^^^^^^^^^^^^^^^
AttributeError: 'Store' object has no attribute 'prior_attention'
======================================================================
ERROR: test_prior_lightblue_record_carried (test_owner_change_carry.OwnerChangeCarryTests.test_prior_lightblue_record_carried)
----------------------------------------------------------------------
Traceback (most recent call last):
File "/private/tmp/claude-501/-Users-macstudio3/81614591-265b-48ed-97b7-6518070fa586/scratchpad/preimage-check/test_owner_change_carry.py", line 71, in test_prior_lightblue_record_carried
prior = self.store.prior_attention(self.new_owner)
^^^^^^^^^^^^^^^^^^^^^^^^^^
AttributeError: 'Store' object has no attribute 'prior_attention'
======================================================================
ERROR: test_prior_orange_record_carried (test_owner_change_carry.OwnerChangeCarryTests.test_prior_orange_record_carried)
----------------------------------------------------------------------
Traceback (most recent call last):
File "/private/tmp/claude-501/-Users-macstudio3/81614591-265b-48ed-97b7-6518070fa586/scratchpad/preimage-check/test_owner_change_carry.py", line 59, in test_prior_orange_record_carried
prior = self.store.prior_attention(self.new_owner)
^^^^^^^^^^^^^^^^^^^^^^^^^^
AttributeError: 'Store' object has no attribute 'prior_attention'
======================================================================
ERROR: test_prior_pink_yields_none_and_settles_to_yellow_status_needed (test_owner_change_carry.OwnerChangeCarryTests.test_prior_pink_yields_none_and_settles_to_yellow_status_needed)
----------------------------------------------------------------------
Traceback (most recent call last):
File "/private/tmp/claude-501/-Users-macstudio3/81614591-265b-48ed-97b7-6518070fa586/scratchpad/preimage-check/test_owner_change_carry.py", line 134, in test_prior_pink_yields_none_and_settles_to_yellow_status_needed
self.assertIsNone(self.store.prior_attention(self.new_owner))
^^^^^^^^^^^^^^^^^^^^^^^^^^
AttributeError: 'Store' object has no attribute 'prior_attention'
======================================================================
ERROR: test_prior_purple_record_carried (test_owner_change_carry.OwnerChangeCarryTests.test_prior_purple_record_carried)
----------------------------------------------------------------------
Traceback (most recent call last):
File "/private/tmp/claude-501/-Users-macstudio3/81614591-265b-48ed-97b7-6518070fa586/scratchpad/preimage-check/test_owner_change_carry.py", line 54, in test_prior_purple_record_carried
prior = self.store.prior_attention(self.new_owner)
^^^^^^^^^^^^^^^^^^^^^^^^^^
AttributeError: 'Store' object has no attribute 'prior_attention'
======================================================================
ERROR: test_prior_record_ticket_is_carried_from_json_source (test_owner_change_carry.OwnerChangeCarryTests.test_prior_record_ticket_is_carried_from_json_source)
----------------------------------------------------------------------
Traceback (most recent call last):
File "/private/tmp/claude-501/-Users-macstudio3/81614591-265b-48ed-97b7-6518070fa586/scratchpad/preimage-check/test_owner_change_carry.py", line 77, in test_prior_record_ticket_is_carried_from_json_source
prior = self.store.prior_attention(self.new_owner)
^^^^^^^^^^^^^^^^^^^^^^^^^^
AttributeError: 'Store' object has no attribute 'prior_attention'
======================================================================
ERROR: test_prior_yellow_record_carried (test_owner_change_carry.OwnerChangeCarryTests.test_prior_yellow_record_carried)
----------------------------------------------------------------------
Traceback (most recent call last):
File "/private/tmp/claude-501/-Users-macstudio3/81614591-265b-48ed-97b7-6518070fa586/scratchpad/preimage-check/test_owner_change_carry.py", line 65, in test_prior_yellow_record_carried
prior = self.store.prior_attention(self.new_owner)
^^^^^^^^^^^^^^^^^^^^^^^^^^
AttributeError: 'Store' object has no attribute 'prior_attention'
======================================================================
ERROR: test_priority_choice_lightblue_outranks_everything (test_owner_change_carry.OwnerChangeCarryTests.test_priority_choice_lightblue_outranks_everything)
----------------------------------------------------------------------
Traceback (most recent call last):
File "/private/tmp/claude-501/-Users-macstudio3/81614591-265b-48ed-97b7-6518070fa586/scratchpad/preimage-check/test_owner_change_carry.py", line 118, in test_priority_choice_lightblue_outranks_everything
prior = self.store.prior_attention(self.new_owner)
^^^^^^^^^^^^^^^^^^^^^^^^^^
AttributeError: 'Store' object has no attribute 'prior_attention'
======================================================================
ERROR: test_priority_choice_when_json_and_legacy_disagree (test_owner_change_carry.OwnerChangeCarryTests.test_priority_choice_when_json_and_legacy_disagree)
----------------------------------------------------------------------
Traceback (most recent call last):
File "/private/tmp/claude-501/-Users-macstudio3/81614591-265b-48ed-97b7-6518070fa586/scratchpad/preimage-check/test_owner_change_carry.py", line 110, in test_priority_choice_when_json_and_legacy_disagree
prior = self.store.prior_attention(self.new_owner)
^^^^^^^^^^^^^^^^^^^^^^^^^^
AttributeError: 'Store' object has no attribute 'prior_attention'
======================================================================
ERROR: test_row_for_canonical_owner_status_unverified_record_carries_warning (test_owner_change_carry.OwnerChangeCarryTests.test_row_for_canonical_owner_status_unverified_record_carries_warning)
----------------------------------------------------------------------
Traceback (most recent call last):
File "/private/tmp/claude-501/-Users-macstudio3/81614591-265b-48ed-97b7-6518070fa586/scratchpad/preimage-check/test_owner_change_carry.py", line 216, in test_row_for_canonical_owner_status_unverified_record_carries_warning
record = self.store.settle_owner_change(self.new_owner, rows=self.rows)
^^^^^^^^^^^^^^^^^^^^^^^^^^^^^^
AttributeError: 'Store' object has no attribute 'settle_owner_change'
======================================================================
ERROR: test_start_command_settles_owner_changed_via_carry (test_owner_change_carry.OwnerChangeCarryTests.test_start_command_settles_owner_changed_via_carry)
----------------------------------------------------------------------
Traceback (most recent call last):
File "/private/tmp/claude-501/-Users-macstudio3/81614591-265b-48ed-97b7-6518070fa586/scratchpad/preimage-check/test_owner_change_carry.py", line 229, in test_start_command_settles_owner_changed_via_carry
settled = self.store.settle_owner_change(self.new_owner, rows=self.rows)
^^^^^^^^^^^^^^^^^^^^^^^^^^^^^^
AttributeError: 'Store' object has no attribute 'settle_owner_change'
======================================================================
ERROR: test_ticket_binding_preserves_carried_attention_and_flag (test_owner_change_carry.OwnerChangeCarryTests.test_ticket_binding_preserves_carried_attention_and_flag)
----------------------------------------------------------------------
Traceback (most recent call last):
File "/private/tmp/claude-501/-Users-macstudio3/81614591-265b-48ed-97b7-6518070fa586/scratchpad/preimage-check/test_owner_change_carry.py", line 274, in test_ticket_binding_preserves_carried_attention_and_flag
settled = self.store.settle_owner_change(self.new_owner, rows=self.rows)
^^^^^^^^^^^^^^^^^^^^^^^^^^^^^^
AttributeError: 'Store' object has no attribute 'settle_owner_change'
======================================================================
ERROR: test_ticket_binding_preserves_owner_status_unverified (test_owner_change_carry.OwnerChangeCarryTests.test_ticket_binding_preserves_owner_status_unverified)
----------------------------------------------------------------------
Traceback (most recent call last):
File "/private/tmp/claude-501/-Users-macstudio3/81614591-265b-48ed-97b7-6518070fa586/scratchpad/preimage-check/test_owner_change_carry.py", line 292, in test_ticket_binding_preserves_owner_status_unverified
settled = self.store.settle_owner_change(self.new_owner, rows=self.rows)
^^^^^^^^^^^^^^^^^^^^^^^^^^^^^^
AttributeError: 'Store' object has no attribute 'settle_owner_change'
======================================================================
FAIL: test_backfill_carries_purple_through_owner_changed (test_owner_change_carry.OwnerChangeCarryTests.test_backfill_carries_purple_through_owner_changed)
----------------------------------------------------------------------
Traceback (most recent call last):
File "/private/tmp/claude-501/-Users-macstudio3/81614591-265b-48ed-97b7-6518070fa586/scratchpad/preimage-check/test_owner_change_carry.py", line 240, in test_backfill_carries_purple_through_owner_changed
self.assertEqual(record["state"], "purple")
~~~~~~~~~~~~~~~~^^^^^^^^^^^^^^^^^^^^^^^^^^^
AssertionError: 'green' != 'purple'
- green
+ purple
======================================================================
FAIL: test_backfill_never_flattens_carried_attention_to_green (test_owner_change_carry.OwnerChangeCarryTests.test_backfill_never_flattens_carried_attention_to_green)
----------------------------------------------------------------------
Traceback (most recent call last):
File "/private/tmp/claude-501/-Users-macstudio3/81614591-265b-48ed-97b7-6518070fa586/scratchpad/preimage-check/test_owner_change_carry.py", line 247, in test_backfill_never_flattens_carried_attention_to_green
self.assertNotEqual(record["state"], "green")
~~~~~~~~~~~~~~~~~~~^^^^^^^^^^^^^^^^^^^^^^^^^^
AssertionError: 'green' == 'green'
======================================================================
FAIL: test_row_for_owner_changed_shows_carried_colour_not_none (test_owner_change_carry.OwnerChangeCarryTests.test_row_for_owner_changed_shows_carried_colour_not_none)
----------------------------------------------------------------------
Traceback (most recent call last):
File "/private/tmp/claude-501/-Users-macstudio3/81614591-265b-48ed-97b7-6518070fa586/scratchpad/preimage-check/test_owner_change_carry.py", line 190, in test_row_for_owner_changed_shows_carried_colour_not_none
self.assertEqual(row["color"], "purple")
~~~~~~~~~~~~~~~~^^^^^^^^^^^^^^^^^^^^^^^^
AssertionError: 'none' != 'purple'
- none
+ purple
======================================================================
FAIL: test_row_for_owner_changed_with_no_prior_attention_shows_yellow (test_owner_change_carry.OwnerChangeCarryTests.test_row_for_owner_changed_with_no_prior_attention_shows_yellow)
----------------------------------------------------------------------
Traceback (most recent call last):
File "/private/tmp/claude-501/-Users-macstudio3/81614591-265b-48ed-97b7-6518070fa586/scratchpad/preimage-check/test_owner_change_carry.py", line 198, in test_row_for_owner_changed_with_no_prior_attention_shows_yellow
self.assertEqual(row["color"], "yellow")
~~~~~~~~~~~~~~~~^^^^^^^^^^^^^^^^^^^^^^^^
AssertionError: 'none' != 'yellow'
- none
+ yellow
======================================================================
FAIL: test_row_never_renders_none_for_owner_changed (test_owner_change_carry.OwnerChangeCarryTests.test_row_never_renders_none_for_owner_changed) (color='purple')
----------------------------------------------------------------------
Traceback (most recent call last):
File "/private/tmp/claude-501/-Users-macstudio3/81614591-265b-48ed-97b7-6518070fa586/scratchpad/preimage-check/test_owner_change_carry.py", line 213, in test_row_never_renders_none_for_owner_changed
self.assertNotEqual(row["color"], "none")
~~~~~~~~~~~~~~~~~~~^^^^^^^^^^^^^^^^^^^^^^
AssertionError: 'none' == 'none'
======================================================================
FAIL: test_row_never_renders_none_for_owner_changed (test_owner_change_carry.OwnerChangeCarryTests.test_row_never_renders_none_for_owner_changed) (color='orange')
----------------------------------------------------------------------
Traceback (most recent call last):
File "/private/tmp/claude-501/-Users-macstudio3/81614591-265b-48ed-97b7-6518070fa586/scratchpad/preimage-check/test_owner_change_carry.py", line 213, in test_row_never_renders_none_for_owner_changed
self.assertNotEqual(row["color"], "none")
~~~~~~~~~~~~~~~~~~~^^^^^^^^^^^^^^^^^^^^^^
AssertionError: 'none' == 'none'
======================================================================
FAIL: test_row_never_renders_none_for_owner_changed (test_owner_change_carry.OwnerChangeCarryTests.test_row_never_renders_none_for_owner_changed) (color='yellow')
----------------------------------------------------------------------
Traceback (most recent call last):
File "/private/tmp/claude-501/-Users-macstudio3/81614591-265b-48ed-97b7-6518070fa586/scratchpad/preimage-check/test_owner_change_carry.py", line 213, in test_row_never_renders_none_for_owner_changed
self.assertNotEqual(row["color"], "none")
~~~~~~~~~~~~~~~~~~~^^^^^^^^^^^^^^^^^^^^^^
AssertionError: 'none' == 'none'
======================================================================
FAIL: test_row_never_renders_none_for_owner_changed (test_owner_change_carry.OwnerChangeCarryTests.test_row_never_renders_none_for_owner_changed) (color='lightblue')
----------------------------------------------------------------------
Traceback (most recent call last):
File "/private/tmp/claude-501/-Users-macstudio3/81614591-265b-48ed-97b7-6518070fa586/scratchpad/preimage-check/test_owner_change_carry.py", line 213, in test_row_never_renders_none_for_owner_changed
self.assertNotEqual(row["color"], "none")
~~~~~~~~~~~~~~~~~~~^^^^^^^^^^^^^^^^^^^^^^
AssertionError: 'none' == 'none'
======================================================================
FAIL: test_row_never_renders_none_for_owner_changed (test_owner_change_carry.OwnerChangeCarryTests.test_row_never_renders_none_for_owner_changed) (color='green')
----------------------------------------------------------------------
Traceback (most recent call last):
File "/private/tmp/claude-501/-Users-macstudio3/81614591-265b-48ed-97b7-6518070fa586/scratchpad/preimage-check/test_owner_change_carry.py", line 213, in test_row_never_renders_none_for_owner_changed
self.assertNotEqual(row["color"], "none")
~~~~~~~~~~~~~~~~~~~^^^^^^^^^^^^^^^^^^^^^^
AssertionError: 'none' == 'none'
======================================================================
FAIL: test_row_never_renders_none_for_owner_changed (test_owner_change_carry.OwnerChangeCarryTests.test_row_never_renders_none_for_owner_changed) (color='pink')
----------------------------------------------------------------------
Traceback (most recent call last):
File "/private/tmp/claude-501/-Users-macstudio3/81614591-265b-48ed-97b7-6518070fa586/scratchpad/preimage-check/test_owner_change_carry.py", line 213, in test_row_never_renders_none_for_owner_changed
self.assertNotEqual(row["color"], "none")
~~~~~~~~~~~~~~~~~~~^^^^^^^^^^^^^^^^^^^^^^
AssertionError: 'none' == 'none'
----------------------------------------------------------------------
Ran 29 tests in 1.425s
FAILED (failures=10, errors=22)